BDBM50135211 CHEMBL3747426
SMILES Br.Br.C(\N=C1/NC(N(S1)c1ccccc1)c1ccccc1)c1ccccc1
InChI Key InChIKey=WFKQMDMAVPAGFG-UHFFFAOYSA-N
Data  1 IC50
  Tab Delimited (TSV)   2D SDfile   Computed 3D by Vconf -m prep SDfile
Find this compound or compounds like it in BindingDB:
Activity Spreadsheet -- Enzyme Inhibition Constant Data from BindingDB
Found 1 hit for monomerid = 50135211
TargetGlycogen synthase kinase-3(Homo sapiens (Human))
Central University
Curated by ChEMBL
LigandPNGBDBM50135211(CHEMBL3747426)
Affinity DataIC50:  1.28E+3nM. Assay description: Inhibition of glycogen synthase kinase-3 (unknown origin)
In DepthDetails ArticlePubMed