BDBM50135280 CHEMBL3745877
SMILES ON(C1CCCO1)c1cc(no1)C(=O)OC12CC3CC(CC(C3)C1)C2
InChI Key InChIKey=RBIHMUOXQAQWPQ-UHFFFAOYSA-N
Data  1 IC50
  Tab Delimited (TSV)   2D SDfile   Computed 3D by Vconf -m prep SDfile
Find this compound or compounds like it in BindingDB:
Activity Spreadsheet -- Enzyme Inhibition Constant Data from BindingDB
Found 1 hit for monomerid = 50135280
TargetSeed linoleate 13S-lipoxygenase-1(Glycine max (soybean))
Lomonosov Moscow State University
Curated by ChEMBL
LigandPNGBDBM50135280(CHEMBL3745877)
Affinity DataIC50:  2.50E+4nM. Assay description: Inhibition of soybean LOX1 assessed as reduction in linoleic acid oxidation measured every 10 s for 10 mins by spectrophotometry analysis
In DepthDetails ArticlePubMed