BDBM50135417 ((R)-5-{4-[(Biphenyl-2-carbonyl)-amino]-benzoyl}-2,3,4,5-tetrahydro-benzo[b][1,4]thiazepin-2-yl)-acetic acid::CHEMBL341173
SMILES OC(=O)C[C@H]1CCN(C(=O)c2ccc(NC(=O)c3ccccc3-c3ccccc3)cc2)c2ccccc2S1
InChI Key InChIKey=NGYIKLFRMYALTL-XMMPIXPASA-N
Data  4 IC50
  Tab Delimited (TSV)   2D SDfile   Computed 3D by Vconf -m prep SDfile
Find this compound or compounds like it in BindingDB:
Activity Spreadsheet -- Enzyme Inhibition Constant Data from BindingDB
Found 4 hits for monomerid = 50135417
TargetVasopressin V2 receptor(Homo sapiens (Human))
Johnson & Johnson Pharmaceutical Research & Development
Curated by ChEMBL
LigandPNGBDBM50135417(((R)-5-{4-[(Biphenyl-2-carbonyl)-amino]-benzoyl}-2...)
Affinity DataIC50:  36nM. Assay description: Inhibition of vasopressin induced cAMP accumulation in human V2 receptor expressing cells
In DepthDetails ArticlePubMed
TargetVasopressin V2 receptor(Homo sapiens (Human))
Johnson & Johnson Pharmaceutical Research & Development
Curated by ChEMBL
LigandPNGBDBM50135417(((R)-5-{4-[(Biphenyl-2-carbonyl)-amino]-benzoyl}-2...)
Affinity DataIC50:  7nM. Assay description: Inhibition of vasopressin induced calcium immobilization in human V1a receptor expressing cells
In DepthDetails ArticlePubMed
TargetVasopressin V1a receptor(Homo sapiens (Human))
Johnson & Johnson Pharmaceutical Research & Development
Curated by ChEMBL
LigandPNGBDBM50135417(((R)-5-{4-[(Biphenyl-2-carbonyl)-amino]-benzoyl}-2...)
Affinity DataIC50:  2.13E+3nM. Assay description: Inhibition of vasopressin induced calcium immobilization in human V1a receptor expressing cells
In DepthDetails ArticlePubMed
TargetVasopressin V1a receptor(Homo sapiens (Human))
Johnson & Johnson Pharmaceutical Research & Development
Curated by ChEMBL
LigandPNGBDBM50135417(((R)-5-{4-[(Biphenyl-2-carbonyl)-amino]-benzoyl}-2...)
Affinity DataIC50:  440nM. Assay description: Ability of the compound to displace [3H]-arginine vasopressin in cloned human V1a receptor
In DepthDetails ArticlePubMed