BDBM50135550 4-{2-[(4-Chloro-pyridine-2-carbonyl)-amino]-3-fluoro-phenoxy}-phthalic acid::CHEMBL132640
SMILES OC(=O)c1ccc(Oc2cccc(F)c2NC(=O)c2cc(Cl)ccn2)cc1C(O)=O
InChI Key InChIKey=PYDCBYWMWBYISI-UHFFFAOYSA-N
Data  4 IC50
  Tab Delimited (TSV)   2D SDfile   Computed 3D by Vconf -m prep SDfile
Find this compound or compounds like it in BindingDB:
Activity Spreadsheet -- Enzyme Inhibition Constant Data from BindingDB
Found 4 hits for monomerid = 50135550
TargetGlycogen phosphorylase, liver form(Rattus norvegicus)
Merck Research Laboratories
Curated by ChEMBL
LigandPNGBDBM50135550(4-{2-[(4-Chloro-pyridine-2-carbonyl)-amino]-3-fluo...)
Affinity DataIC50: <9nM. Assay description: Inhibitory activity against rat liver glycogen phosphorylase
In DepthDetails ArticlePubMed
TargetGlycogen phosphorylase, liver form(Homo sapiens (Human))
Merck Research Laboratories
Curated by ChEMBL
LigandPNGBDBM50135550(4-{2-[(4-Chloro-pyridine-2-carbonyl)-amino]-3-fluo...)
Affinity DataIC50:  10nM. Assay description: Inhibitory activity against HLGP(human liver glycogen phosphorylase)
In DepthDetails ArticlePubMed
TargetGlycogen phosphorylase, muscle form(Homo sapiens (Human))
Merck Research Laboratories
Curated by ChEMBL
LigandPNGBDBM50135550(4-{2-[(4-Chloro-pyridine-2-carbonyl)-amino]-3-fluo...)
Affinity DataIC50:  60nM. Assay description: Inhibitory activity against HMGP(human muscle glycogen phosphorylase)
In DepthDetails ArticlePubMed
TargetGlycogen phosphorylase, liver form(Mus musculus)
Merck Research Laboratories
Curated by ChEMBL
LigandPNGBDBM50135550(4-{2-[(4-Chloro-pyridine-2-carbonyl)-amino]-3-fluo...)
Affinity DataIC50: <9nM. Assay description: Inhibitory activity against mouse liver glycogen phosphorylase
In DepthDetails ArticlePubMed