BDBM50136100 CHEMBL152962::Sulfamic acid hexadecyl ester
SMILES CCCCCCCCCCCCCCCCOS(N)(=O)=O
InChI Key InChIKey=LCZIUXAWQWEEPX-UHFFFAOYSA-N
Data  3 KI
  Tab Delimited (TSV)   2D SDfile   Computed 3D by Vconf -m prep SDfile
Find this compound or compounds like it in BindingDB:
Activity Spreadsheet -- Enzyme Inhibition Constant Data from BindingDB
Found 3 hits for monomerid = 50136100
TargetCarbonic anhydrase 9(Homo sapiens (Human))
University Of Montpellier
Curated by ChEMBL
LigandPNGBDBM50136100(CHEMBL152962 | Sulfamic acid hexadecyl ester)
Affinity DataKi:  22nM. Assay description: Inhibitory activity against human carbonic anhydrase IX.
In DepthDetails ArticlePubMed
TargetCarbonic anhydrase 2(Homo sapiens (Human))
University Of Montpellier
Curated by ChEMBL
LigandPNGBDBM50136100(CHEMBL152962 | Sulfamic acid hexadecyl ester)
Affinity DataKi:  97nM. Assay description: Inhibitory activity against human carbonic anhydrase II.
In DepthDetails ArticlePubMed
TargetCarbonic anhydrase 1(Homo sapiens (Human))
University Of Montpellier
Curated by ChEMBL
LigandPNGBDBM50136100(CHEMBL152962 | Sulfamic acid hexadecyl ester)
Affinity DataKi:  5.80E+4nM. Assay description: Inhibitory activity against human carbonic anhydrase I.
In DepthDetails ArticlePubMed