BDBM50136567 CHEMBL3753821
SMILES [#6]-[#8]-c1ccc(-[#6]-[#6]-[#6](=O)-[#6]-2=[#6](-[#8])-[#6](-[#6]\[#6]=[#6](\[#6])-[#6])=[#6]3-[#8]C([#6])([#6])[#6]=[#6]C3([#6]\[#6]=[#6](\[#6])-[#6])[#6]-2=O)cc1-[#8]
InChI Key InChIKey=ZENXIXUHFOLCLO-UHFFFAOYSA-N
Data  1 KI  1 IC50
  Tab Delimited (TSV)   2D SDfile   Computed 3D by Vconf -m prep SDfile
Find this compound or compounds like it in BindingDB:
Activity Spreadsheet -- Enzyme Inhibition Constant Data from BindingDB
Found 2 hits for monomerid = 50136567
TargetTyrosine-protein phosphatase non-receptor type 1(Homo sapiens (Human))
Qiqihar University
Curated by ChEMBL
LigandPNGBDBM50136567(CHEMBL3753821)
Affinity DataKi:  1.76E+4nM. Assay description: Competitive inhibition of human recombinant PTP1B using p-nitrophenyl phosphate as substrate by spectrophotometry based Lineweaver-Burk plot
In DepthDetails ArticlePubMed
TargetTyrosine-protein phosphatase non-receptor type 1(Homo sapiens (Human))
Qiqihar University
Curated by ChEMBL
LigandPNGBDBM50136567(CHEMBL3753821)
Affinity DataIC50:  2.94E+4nM. Assay description: Inhibition of human recombinant PTP1B using p-nitrophenyl phosphate as substrate by spectrophotometric analysis
In DepthDetails ArticlePubMed