BDBM50136682 CHEMBL141681::Methyl-[3-(naphthalen-1-yloxy)-3-phenyl-propyl]-amine
SMILES CNCCC(Oc1cccc2ccccc12)c1ccccc1
InChI Key InChIKey=IUSCPVMMEKQANO-UHFFFAOYSA-N
Data  2 KI
  Tab Delimited (TSV)   2D SDfile   Computed 3D by Vconf -m prep SDfile
Find this compound or compounds like it in BindingDB:
Activity Spreadsheet -- Enzyme Inhibition Constant Data from BindingDB
Found 2 hits for monomerid = 50136682
TargetSodium-dependent serotonin transporter(Homo sapiens (Human))
Eli Lilly
Curated by ChEMBL
LigandPNGBDBM50136682(CHEMBL141681 | Methyl-[3-(naphthalen-1-yloxy)-3-ph...)
Affinity DataKi:  2.40nM. Assay description: Binding affinity to serotonin transporter, using [3H]-citalopram as radioligand
In DepthDetails ArticlePubMed
TargetSodium-dependent noradrenaline transporter(Homo sapiens (Human))
Eli Lilly
Curated by ChEMBL
LigandPNGBDBM50136682(CHEMBL141681 | Methyl-[3-(naphthalen-1-yloxy)-3-ph...)
Affinity DataKi:  20nM. Assay description: Inhibition of [3H]-nisoxatine binding to norepinephrine (NE) transporter
In DepthDetails ArticlePubMed