BDBM50137065 (1R,4R,5R)-1-(3-Fluoro-benzyloxy)-4,5-dihydroxy-cyclohex-2-enecarboxylic acid::CHEMBL351325
SMILES O[C@@H]1C[C@@](OCc2cccc(F)c2)(C=C[C@H]1O)C(O)=O
InChI Key InChIKey=ABIVSSHNFUABAG-BZPMIXESSA-N
Data  1 KI
  Tab Delimited (TSV)   2D SDfile   Computed 3D by Vconf -m prep SDfile
Find this compound or compounds like it in BindingDB:
Activity Spreadsheet -- Enzyme Inhibition Constant Data from BindingDB
Found 1 hit for monomerid = 50137065
Target3-dehydroquinate dehydratase(Streptomyces coelicolor)
Universidad De Santiago De Compostela
Curated by ChEMBL
LigandPNGBDBM50137065((1R,4R,5R)-1-(3-Fluoro-benzyloxy)-4,5-dihydroxy-cy...)
Affinity DataKi:  4.25E+5nM. Assay description: In vitro inhibitory activity against Streptomyces coelicolor type II dehydroquinase.
In DepthDetails ArticlePubMed