BDBM50137099 1-(7-Formylamino-5,8-dioxo-5,8-dihydro-quinolin-2-yl)-9H-beta-carboline-3-carboxylic acid octyl ester::CHEMBL156598
SMILES CCCCCCCCOC(=O)c1cc2c3ccccc3[nH]c2c(n1)-c1ccc2C(=O)C=C(NC=O)C(=O)c2n1
InChI Key InChIKey=DPJCMIJSKWTHLW-UHFFFAOYSA-N
Data  1 IC50
  Tab Delimited (TSV)   2D SDfile   Computed 3D by Vconf -m prep SDfile
Find this compound or compounds like it in BindingDB:
Activity Spreadsheet -- Enzyme Inhibition Constant Data from BindingDB
Found 1 hit for monomerid = 50137099
TargetReverse transcriptase/RNaseH(Human immunodeficiency virus 1)
Ball State University
Curated by ChEMBL
LigandPNGBDBM50137099(1-(7-Formylamino-5,8-dioxo-5,8-dihydro-quinolin-2-...)
Affinity DataIC50:  7.10E+3nM. Assay description: Inhibitory activity against HIV-reverse transcriptase (HIV-RT)
In DepthDetails ArticlePubMed