BDBM50137331 (R)-2-[(Formyl-hydroxy-amino)-methyl]-hexanoic acid [(S)-2,2-dimethyl-1-(4-morpholin-4-yl-benzoyl)-propyl]-amide::CHEMBL160493
SMILES CCCC[C@H](CN(O)C=O)C(=O)N[C@H](C(=O)c1ccc(cc1)N1CCOCC1)C(C)(C)C
InChI Key InChIKey=RMFDZNQYKLNRBN-DENIHFKCSA-N
Data  1 IC50
  Tab Delimited (TSV)   2D SDfile   Computed 3D by Vconf -m prep SDfile
Find this compound or compounds like it in BindingDB:
Activity Spreadsheet -- Enzyme Inhibition Constant Data from BindingDB
Found 1 hit for monomerid = 50137331
TargetPeptide deformylase(Escherichia coli)
British Biotech Pharmaceuticals
Curated by ChEMBL
LigandPNGBDBM50137331((R)-2-[(Formyl-hydroxy-amino)-methyl]-hexanoic aci...)
Affinity DataIC50:  5nM. Assay description: Inhibitory activity against Escherichia coli peptide deformylase (PDF) Nickel containing enzyme
In DepthDetails ArticlePubMed