BDBM50137436 2-[5-(3-Chloro-4-methoxy-phenyl)-3-difluoromethyl-pyrazol-1-yl]-5-methanesulfonyl-pyridine::CHEMBL366517
SMILES COc1ccc(cc1Cl)-c1cc(nn1-c1ccc(cn1)S(C)(=O)=O)C(F)F
InChI Key InChIKey=QYJCTALTSLGJBB-UHFFFAOYSA-N
Data  2 IC50
  Tab Delimited (TSV)   2D SDfile   Computed 3D by Vconf -m prep SDfile
Find this compound or compounds like it in BindingDB:
Activity Spreadsheet -- Enzyme Inhibition Constant Data from BindingDB
Found 2 hits for monomerid = 50137436
TargetProstaglandin G/H synthase 2(Canis familiaris)
Pfizer
Curated by ChEMBL
LigandPNGBDBM50137436(2-[5-(3-Chloro-4-methoxy-phenyl)-3-difluoromethyl-...)
Affinity DataIC50:  330nM. Assay description: In vitro inhibitory activity against cannine prostaglandin G/H synthase 2.
In DepthDetails ArticlePubMed
TargetProstaglandin G/H synthase 1(Canis familiaris)
Pfizer
Curated by ChEMBL
LigandPNGBDBM50137436(2-[5-(3-Chloro-4-methoxy-phenyl)-3-difluoromethyl-...)
Affinity DataIC50: >5.00E+4nM. Assay description: In vitro inhibitory activity against cannine prostaglandin G/H synthase 1.
In DepthDetails ArticlePubMed