BDBM50137556 5-[(1R,3R)-3-(2,3-Dihydro-benzofuran-4-yl)-2,2-dimethyl-cyclopropyl]-1H-imidazol-2-ylamine::CHEMBL301068
SMILES CC1(C)[C@@H]([C@H]1c1cccc2OCCc12)c1cnc(N)[nH]1
InChI Key InChIKey=MDSBMBXDSJELPF-ZIAGYGMSSA-N
Data  1 IC50
  Tab Delimited (TSV)   2D SDfile   Computed 3D by Vconf -m prep SDfile
Find this compound or compounds like it in BindingDB:
Activity Spreadsheet -- Enzyme Inhibition Constant Data from BindingDB
Found 1 hit for monomerid = 50137556
TargetSodium/hydrogen exchanger 1(Homo sapiens (Human))
Bristol-Myers Squibb Pharmaceutical Research Institute
Curated by ChEMBL
LigandPNGBDBM50137556(5-[(1R,3R)-3-(2,3-Dihydro-benzofuran-4-yl)-2,2-dim...)
Affinity DataIC50:  3.80E+3nM. Assay description: Inhibition of sodium dependent recovery of pH following imposed acidosis in AP1 cell line expressing the human NHE-1 isoform.
In DepthDetails ArticlePubMed