BDBM50137730 (1S,5S,6R)-2-((S)-3,3-Dimethyl-2-{(S)-3-methyl-2-[(pyrazine-2-carbonyl)-amino]-butyrylamino}-butyryl)-octahydro-cyclopenta[c]pyrrole-1-carboxylic acid [1-((S)-cyclopropylaminooxalyl)-3,3-difluoro-propyl]-amide::CHEMBL313182
SMILES CC(C)[C@H](NC(=O)c1cnccn1)C(=O)N[C@H](C(=O)N1C[C@@H]2CCC[C@@H]2[C@H]1C(=O)N[C@@H](CC(F)F)C(=O)C(=O)NC1CC1)C(C)(C)C
InChI Key InChIKey=YBKIXZLAGGQYMQ-SSARXRJASA-N
Data  5 KI  1 IC50
  Tab Delimited (TSV)   2D SDfile   Computed 3D by Vconf -m prep SDfile
Find this compound or compounds like it in BindingDB:
Activity Spreadsheet -- Enzyme Inhibition Constant Data from BindingDB
Found 6 hits for monomerid = 50137730
TargetCathepsin B(Homo sapiens (Human))
Eli Lilly
Curated by ChEMBL
LigandPNGBDBM50137730((1S,5S,6R)-2-((S)-3,3-Dimethyl-2-{(S)-3-methyl-2-[...)
Affinity DataKi:  5nM. Assay description: Inhibitory activity of the compound against cathepsin B
In DepthDetails ArticlePubMed
TargetProcathepsin L(Homo sapiens (Human))
Eli Lilly
Curated by ChEMBL
LigandPNGBDBM50137730((1S,5S,6R)-2-((S)-3,3-Dimethyl-2-{(S)-3-methyl-2-[...)
Affinity DataKi:  30nM. Assay description: Inhibitory activity of the compound against cathepsin L
In DepthDetails ArticlePubMed
TargetGenome polyprotein(Human rhinovirus B)
Eli Lilly
Curated by ChEMBL
LigandPNGBDBM50137730((1S,5S,6R)-2-((S)-3,3-Dimethyl-2-{(S)-3-methyl-2-[...)
Affinity DataKi:  200nM. Assay description: Binding affinity of the compound towards Protease using PNA assay in rats
In DepthDetails ArticlePubMed
TargetChymotrypsinogen A(Bos taurus (bovine))
Eli Lilly
Curated by ChEMBL
LigandPNGBDBM50137730((1S,5S,6R)-2-((S)-3,3-Dimethyl-2-{(S)-3-methyl-2-[...)
Affinity DataKi:  303nM. Assay description: Inhibitory activity of the compound against Chymotrypsin
In DepthDetails ArticlePubMed
TargetCathepsin K(Homo sapiens (Human))
Eli Lilly
Curated by ChEMBL
LigandPNGBDBM50137730((1S,5S,6R)-2-((S)-3,3-Dimethyl-2-{(S)-3-methyl-2-[...)
Affinity DataKi:  1.37E+3nM. Assay description: Inhibitory activity of the compound against cathepsin K
In DepthDetails ArticlePubMed
TargetGenome polyprotein(Human rhinovirus B)
Eli Lilly
Curated by ChEMBL
LigandPNGBDBM50137730((1S,5S,6R)-2-((S)-3,3-Dimethyl-2-{(S)-3-methyl-2-[...)
Affinity DataIC50:  2.90E+3nM. Assay description: Inhibitory activity of the compound against Protease using replicon assay in rats at 25 microM concentration
In DepthDetails ArticlePubMed