BDBM50137739 (1S,3aR,6aS)-2-((S)-3,3-Dimethyl-2-{(S)-3-methyl-2-[(pyrazine-2-carbonyl)-amino]-butyrylamino}-butyryl)-octahydro-cyclopenta[c]pyrrole-1-carboxylic acid (1-cyclopropylaminooxalyl-butyl)-amide::CHEMBL315390
SMILES CCCC(NC(=O)[C@@H]1[C@H]2CCC[C@H]2CN1C(=O)[C@@H](NC(=O)[C@@H](NC(=O)c1cnccn1)C(C)C)C(C)(C)C)C(=O)C(=O)NC1CC1
InChI Key InChIKey=KOKNYEMMHABSGG-CZFCBUMESA-N
Data  1 KI  2 IC50
  Tab Delimited (TSV)   2D SDfile   Computed 3D by Vconf -m prep SDfile
Find this compound or compounds like it in BindingDB:
Activity Spreadsheet -- Enzyme Inhibition Constant Data from BindingDB
Found 3 hits for monomerid = 50137739
TargetGenome polyprotein(Human rhinovirus B)
Eli Lilly
Curated by ChEMBL
LigandPNGBDBM50137739((1S,3aR,6aS)-2-((S)-3,3-Dimethyl-2-{(S)-3-methyl-2...)
Affinity DataKi:  84nM. Assay description: Binding affinity towards Protease using PNA assay in rats
In DepthDetails ArticlePubMed
TargetGenome polyprotein(Human rhinovirus B)
Eli Lilly
Curated by ChEMBL
LigandPNGBDBM50137739((1S,3aR,6aS)-2-((S)-3,3-Dimethyl-2-{(S)-3-methyl-2...)
Affinity DataIC50:  2.20E+3nM. Assay description: Cytotoxic activity in rat liver Huh-7 cells
In DepthDetails ArticlePubMed
TargetGenome polyprotein(Human rhinovirus B)
Eli Lilly
Curated by ChEMBL
LigandPNGBDBM50137739((1S,3aR,6aS)-2-((S)-3,3-Dimethyl-2-{(S)-3-methyl-2...)
Affinity DataIC50: >1.00E+5nM. Assay description: Cytotoxic activity in rat liver Huh-7 cells
In DepthDetails ArticlePubMed