BDBM50137950 Biphenyl-2-carboxylic acid [4-(8-pyridin-3-ylmethyl-5,6,7,8-tetrahydro-1-thia-4,8-diaza-azulene-4-carbonyl)-phenyl]-amide::CHEMBL175182
SMILES O=C(Nc1ccc(cc1)C(=O)N1CCCN(Cc2cccnc2)c2sccc12)c1ccccc1-c1ccccc1
InChI Key InChIKey=ZEHNRQNEVWJTIS-UHFFFAOYSA-N
Data  4 IC50
  Tab Delimited (TSV)   2D SDfile   Computed 3D by Vconf -m prep SDfile
Find this compound or compounds like it in BindingDB:
Activity Spreadsheet -- Enzyme Inhibition Constant Data from BindingDB
Found 4 hits for monomerid = 50137950
TargetVasopressin V2 receptor(Rattus norvegicus (Rat))
Central Pharmaceutical Research Institute
Curated by ChEMBL
LigandPNGBDBM50137950(Biphenyl-2-carboxylic acid [4-(8-pyridin-3-ylmethy...)
Affinity DataIC50:  30nM. Assay description: Inhibitory activity against arginine vasopressin V2 receptor using [3H]-AVP as radioligand in rat adrenal medulla
In DepthDetails ArticlePubMed
TargetVasopressin V1a/V1b receptor(RAT)
Central Pharmaceutical Research Institute
Curated by ChEMBL
LigandPNGBDBM50137950(Biphenyl-2-carboxylic acid [4-(8-pyridin-3-ylmethy...)
Affinity DataIC50:  500nM. Assay description: Inhibitory activity against arginine vasopressin V1 receptor using [3H]AVP as radioligand in rat liver
In DepthDetails ArticlePubMed
TargetVasopressin V1a/V1b receptor(Homo sapiens (Human))
Central Pharmaceutical Research Institute
Curated by ChEMBL
LigandPNGBDBM50137950(Biphenyl-2-carboxylic acid [4-(8-pyridin-3-ylmethy...)
Affinity DataIC50:  700nM. Assay description: Inhibitory activity against arginine vasopressin V1 receptor using [3H]AVP as radioligand in human platelet
In DepthDetails ArticlePubMed
TargetVasopressin V2 receptor(Homo sapiens (Human))
Central Pharmaceutical Research Institute
Curated by ChEMBL
LigandPNGBDBM50137950(Biphenyl-2-carboxylic acid [4-(8-pyridin-3-ylmethy...)
Affinity DataIC50:  60nM. Assay description: Inhibitory activity against human recombinant arginine vasopressin V2 receptor using [3H]-AVP as radioligand in CHO cells
In DepthDetails ArticlePubMed