BDBM50138042 CHEMBL3752044
SMILES C(O\N=C\c1cn(nc1-c1ccccc1)-c1ccccc1)c1ccccc1
InChI Key InChIKey=XQWLHARSWZDSGW-LFVJCYFKSA-N
Data  1 IC50
  Tab Delimited (TSV)   2D SDfile   Computed 3D by Vconf -m prep SDfile
Find this compound or compounds like it in BindingDB:
Activity Spreadsheet -- Enzyme Inhibition Constant Data from BindingDB
Found 1 hit for monomerid = 50138042
TargetPhosphatidylinositol 4,5-bisphosphate 3-kinase catalytic subunit gamma isoform(Mus musculus (Mouse))
Anhui Agricultural University
Curated by ChEMBL
LigandPNGBDBM50138042(CHEMBL3752044)
Affinity DataIC50:  1.83E+4nM. Assay description: Inhibition of PI3K-gamma in mouse lymph node cells assessed as inhibition of ConA-stimulated T cell proliferation
In DepthDetails ArticlePubMed