BDBM50138105 CHEMBL3752081
SMILES CC(C)N1CCC(CC1)NC(=O)c1ccc(OC2CCN(CC2)C(C)C)cc1
InChI Key InChIKey=WBRWXJCLYUHSIN-UHFFFAOYSA-N
Data  1 KI
  Tab Delimited (TSV)   2D SDfile   Computed 3D by Vconf -m prep SDfile
Find this compound or compounds like it in BindingDB:
Activity Spreadsheet -- Enzyme Inhibition Constant Data from BindingDB
Found 1 hit for monomerid = 50138105
TargetHistamine H3 receptor(Homo sapiens (Human))
Suven Life Sciences
Curated by ChEMBL
LigandPNGBDBM50138105(CHEMBL3752081)
Affinity DataKi:  8.30nM. Assay description: Displacement of [3H]R-alpha-methyl histamine from recombinant human H3 receptor
In DepthDetails ArticlePubMed