BDBM50138194 (4S,5S)-5-Ethyl-4-methyl-oxazolidin-(2Z)-ylideneamine::CHEMBL110705
SMILES CC[C@@H]1OC(N)=N[C@H]1C
InChI Key InChIKey=PDSCDFTZWQFMTC-WHFBIAKZSA-N
Data  2 IC50
  Tab Delimited (TSV)   2D SDfile   Computed 3D by Vconf -m prep SDfile
Find this compound or compounds like it in BindingDB:
Activity Spreadsheet -- Enzyme Inhibition Constant Data from BindingDB
Found 2 hits for monomerid = 50138194
TargetNitric oxide synthase, inducible(Mus musculus (mouse))
Dainippon Pharmaceutical
Curated by ChEMBL
LigandPNGBDBM50138194((4S,5S)-5-Ethyl-4-methyl-oxazolidin-(2Z)-ylideneam...)
Affinity DataIC50:  120nM. Assay description: Inhibition of inducible nitric oxide synthase (iNOS) in mice
In DepthDetails ArticlePubMed
TargetNitric oxide synthase, brain(Mus musculus)
Dainippon Pharmaceutical
Curated by ChEMBL
LigandPNGBDBM50138194((4S,5S)-5-Ethyl-4-methyl-oxazolidin-(2Z)-ylideneam...)
Affinity DataIC50:  1.70E+3nM. Assay description: Inhibition of neuronal nitric oxide synthase (nNOS) in mice
In DepthDetails ArticlePubMed