BDBM50138198 (4S,5R)-4,5-Diethyl-oxazolidin-(2Z)-ylideneamine::CHEMBL108319
SMILES CC[C@H]1OC(N)=N[C@H]1CC
InChI Key InChIKey=KYKDCIRQVPPSOP-NTSWFWBYSA-N
Data  2 IC50
  Tab Delimited (TSV)   2D SDfile   Computed 3D by Vconf -m prep SDfile
Find this compound or compounds like it in BindingDB:
Activity Spreadsheet -- Enzyme Inhibition Constant Data from BindingDB
Found 2 hits for monomerid = 50138198
TargetNitric oxide synthase, inducible(Mus musculus (mouse))
Dainippon Pharmaceutical
Curated by ChEMBL
LigandPNGBDBM50138198((4S,5R)-4,5-Diethyl-oxazolidin-(2Z)-ylideneamine |...)
Affinity DataIC50:  130nM. Assay description: Inhibition of inducible nitric oxide synthase (iNOS) in mice
In DepthDetails ArticlePubMed
TargetNitric oxide synthase, brain(Mus musculus)
Dainippon Pharmaceutical
Curated by ChEMBL
LigandPNGBDBM50138198((4S,5R)-4,5-Diethyl-oxazolidin-(2Z)-ylideneamine |...)
Affinity DataIC50:  1.20E+3nM. Assay description: Inhibition of neuronal nitric oxide synthase (nNOS) in mice
In DepthDetails ArticlePubMed