BDBM50138453 2-Hydroxymethyl-4-[5-(2-methoxy-phenyl)-3-trifluoromethyl-pyrazol-1-yl]-benzenesulfonamide::CHEMBL357044
SMILES COc1ccccc1-c1cc(nn1-c1ccc(c(CO)c1)S(N)(=O)=O)C(F)(F)F
InChI Key InChIKey=UHYRKCYAIABMIQ-UHFFFAOYSA-N
Data  2 IC50
  Tab Delimited (TSV)   2D SDfile   Computed 3D by Vconf -m prep SDfile
Find this compound or compounds like it in BindingDB:
Activity Spreadsheet -- Enzyme Inhibition Constant Data from BindingDB
Found 2 hits for monomerid = 50138453
TargetProstaglandin G/H synthase 2(Homo sapiens (Human))
Discovery Research-Dr. Reddy'S Laboratories
Curated by ChEMBL
LigandPNGBDBM50138453(2-Hydroxymethyl-4-[5-(2-methoxy-phenyl)-3-trifluor...)
Affinity DataIC50:  2.86E+4nM. Assay description: Inhibitory activity against human Prostaglandin G/H synthase 2 expressed in sf-9 cells infected with baculovirus
In DepthDetails ArticlePubMed
TargetProstaglandin G/H synthase 1(Ovis aries (Sheep))
Discovery Research-Dr. Reddy'S Laboratories
Curated by ChEMBL
LigandPNGBDBM50138453(2-Hydroxymethyl-4-[5-(2-methoxy-phenyl)-3-trifluor...)
Affinity DataIC50:  1.15E+6nM. Assay description: Inhibitory activity against prostaglandin G/H synthase 1 from ram seminal vesicles
In DepthDetails ArticlePubMed