BDBM50138717 (1-Hydroxy-1-phosphono-2-m-tolyl-ethyl)-phosphonic acid::(1-hydroxy-2-m-tolyl-ethylene)-1,1-bisphosphonate::CHEMBL127588
SMILES Cc1cccc(CC(O)(P(O)(O)=O)P(O)(O)=O)c1
InChI Key InChIKey=ZGHAOPFGBZKCBZ-UHFFFAOYSA-N
Data  1 IC50
  Tab Delimited (TSV)   2D SDfile   Computed 3D by Vconf -m prep SDfile
Find this compound or compounds like it in BindingDB:
Activity Spreadsheet -- Enzyme Inhibition Constant Data from BindingDB
Found 1 hit for monomerid = 50138717
TargetH(+)-exporting diphosphatase(Trypanosoma brucei)
University Of Illinois At Urbana-Champaign
Curated by ChEMBL
LigandPNGBDBM50138717((1-Hydroxy-1-phosphono-2-m-tolyl-ethyl)-phosphonic...)
Affinity DataIC50:  2.53E+4nM. Assay description: Inhibition of recombinant Trypanosoma brucei soluble vacuolar pyrophosphatase expressed in Escherichia coli
In DepthDetails ArticlePubMed