BDBM50138745 (3-(4-chlorophenyl)-5-(methylthio)-1H-1,2,4-triazol-1-yl)(piperidin-1-yl)methanone::CHEMBL130666::[3-(4-Chloro-phenyl)-5-methylsulfanyl-[1,2,4]triazol-1-yl]-piperidin-1-yl-methanone
SMILES CSc1nc(nn1C(=O)N1CCCCC1)-c1ccc(Cl)cc1
InChI Key InChIKey=PBUOZLNZOBWRDT-UHFFFAOYSA-N
Data  4 IC50
  Tab Delimited (TSV)   2D SDfile   Computed 3D by Vconf -m prep SDfile
Find this compound or compounds like it in BindingDB:
Activity Spreadsheet -- Enzyme Inhibition Constant Data from BindingDB
Found 4 hits for monomerid = 50138745
TargetAcetylcholinesterase(Homo sapiens (Human))
Novo Nordisk
Curated by ChEMBL
LigandPNGBDBM50138745((3-(4-chlorophenyl)-5-(methylthio)-1H-1,2,4-triazo...)
Affinity DataIC50:  26nM. Assay description: Inhibitory concentration against acetylcholinesterase
In DepthDetails ArticlePubMed
TargetHormone-sensitive lipase(Rattus norvegicus (Rat))
University Of Jordan
Curated by ChEMBL
LigandPNGBDBM50138745((3-(4-chlorophenyl)-5-(methylthio)-1H-1,2,4-triazo...)
Affinity DataIC50:  1.76nM. Assay description: Inhibition of HSL in Wistar rat isolated fat cells by spectrophotometric assay
In DepthDetails ArticlePubMed
TargetCholinesterase(Homo sapiens (Human))
Novo Nordisk
Curated by ChEMBL
LigandPNGBDBM50138745((3-(4-chlorophenyl)-5-(methylthio)-1H-1,2,4-triazo...)
Affinity DataIC50:  900nM. Assay description: Inhibitory concentration against butyrylcholinesterase.
In DepthDetails ArticlePubMed
TargetHormone-sensitive lipase(Homo sapiens (Human))
Novo Nordisk
Curated by ChEMBL
LigandPNGBDBM50138745((3-(4-chlorophenyl)-5-(methylthio)-1H-1,2,4-triazo...)
Affinity DataIC50:  100nM. Assay description: Inhibition of hormone sensitive lipase (HSL).
In DepthDetails ArticlePubMed