BDBM50138748 5-Methylsulfanyl-3-naphthalen-2-yl-[1,2,4]triazole-1-carboxylic acid dimethylamide::CHEMBL335033
SMILES CSc1nc(nn1C(=O)N(C)C)-c1ccc2ccccc2c1
InChI Key InChIKey=FCWFKSMUNCZMFT-UHFFFAOYSA-N
Data  3 IC50
  Tab Delimited (TSV)   2D SDfile   Computed 3D by Vconf -m prep SDfile
Find this compound or compounds like it in BindingDB:
Activity Spreadsheet -- Enzyme Inhibition Constant Data from BindingDB
Found 3 hits for monomerid = 50138748
TargetAcetylcholinesterase(Homo sapiens (Human))
Novo Nordisk
Curated by ChEMBL
LigandPNGBDBM50138748(5-Methylsulfanyl-3-naphthalen-2-yl-[1,2,4]triazole...)
Affinity DataIC50:  50nM. Assay description: Inhibitory concentration against acetylcholinesterase
In DepthDetails ArticlePubMed
TargetHormone-sensitive lipase(Homo sapiens (Human))
Novo Nordisk
Curated by ChEMBL
LigandPNGBDBM50138748(5-Methylsulfanyl-3-naphthalen-2-yl-[1,2,4]triazole...)
Affinity DataIC50:  2.00E+3nM. Assay description: Inhibition of hormone sensitive lipase (HSL).
In DepthDetails ArticlePubMed
TargetCholinesterase(Homo sapiens (Human))
Novo Nordisk
Curated by ChEMBL
LigandPNGBDBM50138748(5-Methylsulfanyl-3-naphthalen-2-yl-[1,2,4]triazole...)
Affinity DataIC50:  130nM. Assay description: Inhibitory concentration against butyrylcholinesterase.
In DepthDetails ArticlePubMed