BDBM50138923 4-Chloro-N-[1-[3-(4-chloro-phenyl)-4-phenyl-4,5-dihydro-pyrazol-1-yl]-1-methylamino-meth-(E)-ylidene]-benzamide::CHEMBL158700
SMILES C\N=C(/NC(=O)c1ccc(Cl)cc1)N1CC(C(=N1)c1ccc(Cl)cc1)c1ccccc1
InChI Key InChIKey=SUVOSQNAWGJSJD-UHFFFAOYSA-N
Data  1 KI
  Tab Delimited (TSV)   2D SDfile   Computed 3D by Vconf -m prep SDfile
Find this compound or compounds like it in BindingDB:
Activity Spreadsheet -- Enzyme Inhibition Constant Data from BindingDB
Found 1 hit for monomerid = 50138923
TargetCannabinoid receptor 1(Homo sapiens (Human))
Solvay Pharma
Curated by ChEMBL
LigandPNGBDBM50138923(4-Chloro-N-[1-[3-(4-chloro-phenyl)-4-phenyl-4,5-di...)
Affinity DataKi:  70.6nM. Assay description: Displacement of CP-55,940 binding from recombinant human cannabinoid receptor 1 expressed in CHO cells
In DepthDetails ArticlePubMed