BDBM50139191 4-ethyl-23-oxo-8-oxa-1,15,17,21-tetraazapentacyclo[19.2.2.13,7.19,13.015,19]heptacosa-3(27),4,6,9(26),10,12,16,18-octaen-10-yl cyanide::CHEMBL160204
SMILES CCc1ccc2Oc3cc(Cn4cncc4CN4CCN(Cc1c2)C(=O)C4)ccc3C#N
InChI Key InChIKey=CQCNIBNGGPUKMH-UHFFFAOYSA-N
Data  3 IC50
  Tab Delimited (TSV)   2D SDfile   Computed 3D by Vconf -m prep SDfile
Find this compound or compounds like it in BindingDB:
Activity Spreadsheet -- Enzyme Inhibition Constant Data from BindingDB
Found 3 hits for monomerid = 50139191
LigandPNGBDBM50139191(4-ethyl-23-oxo-8-oxa-1,15,17,21-tetraazapentacyclo...)
Affinity DataIC50:  124nM. Assay description: Inhibition of human Geranylgeranyl transferase type I incorporation of [3H]GGPP into biotinylated peptide corresponding to the C-terminus of human Ki...
In DepthDetails ArticlePubMed
TargetProtein farnesyltransferase subunit beta/geranylgeranyltransferase type-1 subunit alpha(Homo sapiens (Human))
Merck Research Laboratories
Curated by ChEMBL
LigandPNGBDBM50139191(4-ethyl-23-oxo-8-oxa-1,15,17,21-tetraazapentacyclo...)
Affinity DataIC50:  1.20nM. Assay description: Displacement of radiolabeled FTI from Farnesyltransferase in cultured Ha-ras transformed RAT1 cells.
In DepthDetails ArticlePubMed
TargetProtein farnesyltransferase subunit beta/geranylgeranyltransferase type-1 subunit alpha(Homo sapiens (Human))
Merck Research Laboratories
Curated by ChEMBL
LigandPNGBDBM50139191(4-ethyl-23-oxo-8-oxa-1,15,17,21-tetraazapentacyclo...)
Affinity DataIC50:  0.660nM. Assay description: Inhibition of human Farnesyltransferase -catalyzed incorporation of [3H]-FPP into recombinant Ras-CVIM.
In DepthDetails ArticlePubMed