BDBM50139481 (R)-2,2-dimethyl-6-phenylhexan-3-yl(S)-1,2-dioxo-1-((R)-1-phenylethylamino)heptan-3-ylcarbamate::CHEMBL163286::[(S)-1-((R)-1-Phenyl-ethylaminooxalyl)-pentyl]-carbamic acid (R)-1-tert-butyl-4-phenyl-butyl ester
SMILES CCCC[C@H](NC(=O)O[C@H](CCCc1ccccc1)C(C)(C)C)C(=O)C(=O)N[C@H](C)c1ccccc1
InChI Key InChIKey=MXQQIWVURNRGKR-ZSQFBXSQSA-N
Data  2 IC50
  Tab Delimited (TSV)   2D SDfile   Computed 3D by Vconf -m prep SDfile
Find this compound or compounds like it in BindingDB:
Activity Spreadsheet -- Enzyme Inhibition Constant Data from BindingDB
Found 2 hits for monomerid = 50139481
TargetCathepsin K(Homo sapiens (Human))
Chinese Academy Of Sciences
Curated by ChEMBL
LigandPNGBDBM50139481((R)-2,2-dimethyl-6-phenylhexan-3-yl(S)-1,2-dioxo-1...)
Affinity DataIC50:  0.794nM. Assay description: Inhibition of human cathepsin K
In DepthDetails ArticlePubMed
TargetCathepsin K(Homo sapiens (Human))
Chinese Academy Of Sciences
Curated by ChEMBL
LigandPNGBDBM50139481((R)-2,2-dimethyl-6-phenylhexan-3-yl(S)-1,2-dioxo-1...)
Affinity DataIC50:  0.790nM. Assay description: Inhibitory activity against human cathepsin K
In DepthDetails ArticlePubMed