BDBM50139490 2,2,4,4-tetramethylpentan-3-yl(S)-1,2-dioxo-1-((R)-1-phenylethylamino)heptan-3-ylcarbamate::CHEMBL354473::[(S)-1-((R)-1-Phenyl-ethylaminooxalyl)-pentyl]-carbamic acid 1-tert-butyl-2,2-dimethyl-propyl ester
SMILES CCCC[C@H](NC(=O)OC(C(C)(C)C)C(C)(C)C)C(=O)C(=O)N[C@H](C)c1ccccc1
InChI Key InChIKey=GFFCOHZURVHDPK-MJGOQNOKSA-N
Data  2 IC50
  Tab Delimited (TSV)   2D SDfile   Computed 3D by Vconf -m prep SDfile
Find this compound or compounds like it in BindingDB:
Activity Spreadsheet -- Enzyme Inhibition Constant Data from BindingDB
Found 2 hits for monomerid = 50139490
TargetCathepsin K(Homo sapiens (Human))
Chinese Academy Of Sciences
Curated by ChEMBL
LigandPNGBDBM50139490(2,2,4,4-tetramethylpentan-3-yl(S)-1,2-dioxo-1-((R)...)
Affinity DataIC50:  0.708nM. Assay description: Inhibition of human cathepsin K
In DepthDetails ArticlePubMed
TargetCathepsin K(Homo sapiens (Human))
Chinese Academy Of Sciences
Curated by ChEMBL
LigandPNGBDBM50139490(2,2,4,4-tetramethylpentan-3-yl(S)-1,2-dioxo-1-((R)...)
Affinity DataIC50:  0.710nM. Assay description: Inhibitory activity against human cathepsin K
In DepthDetails ArticlePubMed