BDBM50139531 CHEMBL165545::Octyl-carbamic acid 3-octylcarbamoyloxy-phenyl ester
SMILES CCCCCCCCNC(=O)Oc1cccc(OC(=O)NCCCCCCCC)c1
InChI Key InChIKey=ITXJGAQGOBMOPG-UHFFFAOYSA-N
Data  1 KI
  Tab Delimited (TSV)   2D SDfile   Computed 3D by Vconf -m prep SDfile
Find this compound or compounds like it in BindingDB:
Activity Spreadsheet -- Enzyme Inhibition Constant Data from BindingDB
Found 1 hit for monomerid = 50139531
TargetPhospholipase A2, major isoenzyme(Sus scrofa (pig))
National Chung-Hsing University
Curated by ChEMBL
LigandPNGBDBM50139531(CHEMBL165545 | Octyl-carbamic acid 3-octylcarbamoy...)
Affinity DataKi:  4.00E+3nM. Assay description: Binding affinity of the compound against phospholipase A2 of Naja mocambique mocambique
In DepthDetails ArticlePubMed