BDBM50139634 4-{4-[3-(4-Chloro-3-trifluoromethyl-phenyl)-ureido]-phenoxy}-pyridine-2-carboxylic acid isopropylamide::CHEMBL164291
SMILES CC(C)NC(=O)c1cc(Oc2ccc(NC(=O)Nc3ccc(Cl)c(c3)C(F)(F)F)cc2)ccn1
InChI Key InChIKey=PRLFUSISELQPTQ-UHFFFAOYSA-N
Data  1 IC50
  Tab Delimited (TSV)   2D SDfile   Computed 3D by Vconf -m prep SDfile
Find this compound or compounds like it in BindingDB:
Activity Spreadsheet -- Enzyme Inhibition Constant Data from BindingDB
Found 1 hit for monomerid = 50139634
TargetRAF proto-oncogene serine/threonine-protein kinase(Homo sapiens (Human))
Bayer Research Center
Curated by ChEMBL
LigandPNGBDBM50139634(4-{4-[3-(4-Chloro-3-trifluoromethyl-phenyl)-ureido...)
Affinity DataIC50:  2.30E+3nM. Assay description: Inhibitory activity against human Raf-1 kinase
In DepthDetails ArticlePubMed