BDBM50139639 CHEMBL3764435
SMILES CCOC(=O)c1sc(NC(=O)Cc2c[nH]cn2)c(C#N)c1-c1ccc(Cl)cc1
InChI Key InChIKey=OQGKNOILXLDTOX-UHFFFAOYSA-N
Data  1 IC50
  Tab Delimited (TSV)   2D SDfile   Computed 3D by Vconf -m prep SDfile
Find this compound or compounds like it in BindingDB:
Activity Spreadsheet -- Enzyme Inhibition Constant Data from BindingDB
Found 1 hit for monomerid = 50139639
LigandPNGBDBM50139639(CHEMBL3764435)
Affinity DataIC50: >1.00E+5nM. Assay description: Inhibition of human recombinant farnesyltransferase using farnesyl pyrophosphate and Dansyl-GCVLS peptide after 15 mins by fluorescence assay
In DepthDetails ArticlePubMed