BDBM50139780 CHEMBL3763215
SMILES Cc1cccc(CNC(=O)c2nc(N)nc3c(F)cccc23)c1
InChI Key InChIKey=HXRIKMSRKFZFAO-UHFFFAOYSA-N
Data  2 KI
  Tab Delimited (TSV)   2D SDfile   Computed 3D by Vconf -m prep SDfile
Find this compound or compounds like it in BindingDB:
Activity Spreadsheet -- Enzyme Inhibition Constant Data from BindingDB
Found 2 hits for monomerid = 50139780
TargetAdenosine receptor A2a(Homo sapiens (Human))
Merck Research Laboratories
Curated by ChEMBL
LigandPNGBDBM50139780(CHEMBL3763215)
Affinity DataKi:  8.40nM. Assay description: Displacement of [3H]SCH-58261 from human adenosine A2A receptor expressed in HEK cell membranes after 60 mins by microplate scintillation counting an...
In DepthDetails ArticlePubMed
TargetAdenosine receptor A1(Homo sapiens (Human))
Merck Research Laboratories
Curated by ChEMBL
LigandPNGBDBM50139780(CHEMBL3763215)
Affinity DataKi:  112nM. Assay description: Displacement of [3H]DPCPX from human adenosine A1 receptor expressed in CHO cell membranes after 60 mins by microplate scintillation counting analysi...
In DepthDetails ArticlePubMed