BDBM50139843 CHEMBL3765540
SMILES COc1ccc2oc(c(CCNC(C)=O)c2n1)-c1ccccc1
InChI Key InChIKey=LZQVDDXJOZFBFA-UHFFFAOYSA-N
Data  2 KI
  Tab Delimited (TSV)   2D SDfile   Computed 3D by Vconf -m prep SDfile
Find this compound or compounds like it in BindingDB:
Activity Spreadsheet -- Enzyme Inhibition Constant Data from BindingDB
Found 2 hits for monomerid = 50139843
TargetMelatonin receptor type 1A(Homo sapiens (Human))
Universit£
Curated by ChEMBL
LigandPNGBDBM50139843(CHEMBL3765540)
Affinity DataKi:  0.0400nM. Assay description: Displacement of [125I]2-Iodomelatonin from human MT1 receptor expressed in HEK293 cells after 120 mins by radioligand competition assay
In DepthDetails ArticlePubMed
TargetMelatonin receptor type 1B(Homo sapiens (Human))
Universit£
Curated by ChEMBL
LigandPNGBDBM50139843(CHEMBL3765540)
Affinity DataKi:  0.140nM. Assay description: Displacement of [125I]2-Iodomelatonin from human MT2 receptor expressed in HEK293 cells after 120 mins by radioligand competition assay
In DepthDetails ArticlePubMed