BDBM50139853 CHEMBL3764143::US10577361, E14
SMILES Cn1c(SCCCN2CCOC(C2)c2ccc(cc2)C(F)(F)F)nnc1-c1ccc(cc1)-c1ncco1
InChI Key InChIKey=PMZOPKCHYGDQPO-UHFFFAOYSA-N
Data  14 KI  6 IC50
  Tab Delimited (TSV)   2D SDfile   Computed 3D by Vconf -m prep SDfile
Find this compound or compounds like it in BindingDB:
Activity Spreadsheet -- Enzyme Inhibition Constant Data from BindingDB
Found 20 hits for monomerid = 50139853
TargetD(3) dopamine receptor(Homo sapiens (Human))
Indivior
US Patent
LigandPNGBDBM50139853(CHEMBL3764143 | US10577361, E14)
Affinity DataKi:  4.90nM. Assay description: [3H]-Spiperone Binding Assay at hD3 and hD4 recombinant receptors CHO cells transiently transfected with human dopamine type 3 or 4 receptors (CHO-hD...
In DepthDetails US Patent
TargetD(3) dopamine receptor(Rattus norvegicus (Rat))
Aptuit
Curated by ChEMBL
LigandPNGBDBM50139853(CHEMBL3764143 | US10577361, E14)
Affinity DataKi:  5nM. Assay description: Displacement of [3H]-dofetilide from human ERG potassium channel by scintillation proximity assay
In DepthDetails ArticlePubMed
TargetD(3) dopamine receptor(Rattus norvegicus (Rat))
Aptuit
Curated by ChEMBL
LigandPNGBDBM50139853(CHEMBL3764143 | US10577361, E14)
Affinity DataKi:  5.01nM. Assay description: Displacement of [3H]-dofetilide from human ERG potassium channel by scintillation proximity assay
In DepthDetails ArticlePubMed
TargetD(3) dopamine receptor(Homo sapiens (Human))
Indivior
US Patent
LigandPNGBDBM50139853(CHEMBL3764143 | US10577361, E14)
Affinity DataKi:  10nM. Assay description: Agonist activity at human dopamine D3 receptor expressed in CHO cells after 90 mins by [35S]-GTPgamma S assay
In DepthDetails ArticlePubMed
TargetD(3) dopamine receptor(Homo sapiens (Human))
Indivior
US Patent
LigandPNGBDBM50139853(CHEMBL3764143 | US10577361, E14)
Affinity DataKi:  10nM. Assay description: Agonist activity at human dopamine D3 receptor expressed in CHO cells after 90 mins by [35S]-GTPgamma S assay
In DepthDetails ArticlePubMed
TargetD(3) dopamine receptor(Rattus norvegicus (Rat))
Aptuit
Curated by ChEMBL
LigandPNGBDBM50139853(CHEMBL3764143 | US10577361, E14)
Affinity DataKi:  398nM. Assay description: Displacement of [125I]-7-OH-PIPAT from rat brain dopamine D3 receptor after 45 mins by microplate scintillation counting analysis
In DepthDetails ArticlePubMed
TargetPotassium voltage-gated channel subfamily H member 2(Homo sapiens (Human))
Aptuit
Curated by ChEMBL
LigandPNGBDBM50139853(CHEMBL3764143 | US10577361, E14)
Affinity DataKi:  999nM. Assay description: Displacement of [125I]-7-OH-PIPAT from rat brain dopamine D2 receptor after 45 mins by microplate scintillation counting analysis
In DepthDetails ArticlePubMed
TargetPotassium voltage-gated channel subfamily H member 2(Homo sapiens (Human))
Aptuit
Curated by ChEMBL
LigandPNGBDBM50139853(CHEMBL3764143 | US10577361, E14)
Affinity DataKi:  1.00E+3nM. Assay description: Displacement of [3H]-dofetilide from human ERG potassium channel by scintillation proximity assay
In DepthDetails ArticlePubMed
TargetD(2) dopamine receptor(Homo sapiens (Human))
Indivior
US Patent
LigandPNGBDBM50139853(CHEMBL3764143 | US10577361, E14)
Affinity DataKi:  1.48E+3nM. Assay description: CHO cells stably expressing human dopamine receptor type 2, long variant (hD2L), coupled to Gα16 protein (CHO-Gα16-hD2L) were re-suspended ...
In DepthDetails US Patent
TargetD(2) dopamine receptor(Homo sapiens (Human))
Indivior
US Patent
LigandPNGBDBM50139853(CHEMBL3764143 | US10577361, E14)
Affinity DataKi:  1.58E+3nM. Assay description: Agonist activity at human dopamine D3 receptor expressed in CHO cells after 90 mins by [35S]-GTPgamma S assay
In DepthDetails ArticlePubMed
TargetD(2) dopamine receptor(Homo sapiens (Human))
Indivior
US Patent
LigandPNGBDBM50139853(CHEMBL3764143 | US10577361, E14)
Affinity DataKi:  1.59E+3nM. Assay description: Agonist activity at human dopamine D3 receptor expressed in CHO cells after 90 mins by [35S]-GTPgamma S assay
In DepthDetails ArticlePubMed
TargetD(3) dopamine receptor(Homo sapiens (Human))
Indivior
US Patent
LigandPNGBDBM50139853(CHEMBL3764143 | US10577361, E14)
Affinity DataKi: <1.00E+4nM. Assay description: Displacement of [125I]-7-OH-PIPAT from rat brain dopamine D3 receptor after 45 mins by microplate scintillation counting analysis
In DepthDetails ArticlePubMed
TargetD(3) dopamine receptor(Homo sapiens (Human))
Indivior
US Patent
LigandPNGBDBM50139853(CHEMBL3764143 | US10577361, E14)
Affinity DataKi: <1.00E+4nM. Assay description: Agonist activity at human dopamine D3 receptor expressed in CHO cells after 90 mins by [35S]-GTPgamma S assay
In DepthDetails ArticlePubMed
TargetD(2) dopamine receptor(Homo sapiens (Human))
Indivior
US Patent
LigandPNGBDBM50139853(CHEMBL3764143 | US10577361, E14)
Affinity DataKi:  1.58E+4nM. Assay description: Displacement of [125I]-7-OH-PIPAT from rat brain dopamine D2 receptor after 45 mins by microplate scintillation counting analysis
In DepthDetails ArticlePubMed
TargetCytochrome P450 3A4(Homo sapiens (Human))
Aptuit
Curated by ChEMBL
LigandPNGBDBM50139853(CHEMBL3764143 | US10577361, E14)
Affinity DataIC50: >3.00E+3nM. Assay description: Inhibition of human CYP3A4 expressed in bactosome using DBOMF as substrate
In DepthDetails ArticlePubMed
TargetCytochrome P450 2D6(Homo sapiens (Human))
Aptuit
Curated by ChEMBL
LigandPNGBDBM50139853(CHEMBL3764143 | US10577361, E14)
Affinity DataIC50: >3.00E+3nM. Assay description: Inhibition of human CYP2D6 expressed in bactosome
In DepthDetails ArticlePubMed
TargetCytochrome P450 2C19(Homo sapiens (Human))
Aptuit
Curated by ChEMBL
LigandPNGBDBM50139853(CHEMBL3764143 | US10577361, E14)
Affinity DataIC50: >3.00E+3nM. Assay description: Inhibition of human CYP2C19 expressed in bactosome
In DepthDetails ArticlePubMed
TargetCytochrome P450 2C9(Homo sapiens (Human))
Aptuit
Curated by ChEMBL
LigandPNGBDBM50139853(CHEMBL3764143 | US10577361, E14)
Affinity DataIC50: >3.00E+3nM. Assay description: Inhibition of human CYP2C9 expressed in bactosome
In DepthDetails ArticlePubMed
TargetCytochrome P450 1A2(Homo sapiens (Human))
Aptuit
Curated by ChEMBL
LigandPNGBDBM50139853(CHEMBL3764143 | US10577361, E14)
Affinity DataIC50: >3.00E+3nM. Assay description: Inhibition of human CYP1A2 expressed in bactosome
In DepthDetails ArticlePubMed
TargetCytochrome P450 3A4(Homo sapiens (Human))
Aptuit
Curated by ChEMBL
LigandPNGBDBM50139853(CHEMBL3764143 | US10577361, E14)
Affinity DataIC50: >3.00E+3nM. Assay description: Displacement of [125I]-7-OH-PIPAT from rat brain dopamine D3 receptor after 45 mins by microplate scintillation counting analysis
In DepthDetails ArticlePubMed