BDBM50140059 CHEMBL3753015
SMILES CO[C@H]1[C@@H](CO)N=C(NCc2ccc(C)cc2)[C@H](O)[C@H]1O
InChI Key InChIKey=CIETWNFOKCLVCF-SYQHCUMBSA-N
Data  2 KI  1 IC50
  Tab Delimited (TSV)   2D SDfile   Computed 3D by Vconf -m prep SDfile
Find this compound or compounds like it in BindingDB:
Activity Spreadsheet -- Enzyme Inhibition Constant Data from BindingDB
Found 3 hits for monomerid = 50140059
TargetBeta-galactosidase(Escherichia coli)
University Of Arkansas
Curated by ChEMBL
LigandPNGBDBM50140059(CHEMBL3753015)
Affinity DataKi:  32nM. Assay description: Competitive inhibition of Escherichia coli beta-galactosidase assessed as p-nitrophenyl-beta-D-galactopyranoside substrate hydrolysis by UV/Vis spect...
In DepthDetails ArticlePubMed
TargetBeta-galactosidase(Bos taurus (Bovine))
University Of Arkansas
Curated by ChEMBL
LigandPNGBDBM50140059(CHEMBL3753015)
Affinity DataKi:  840nM. Assay description: Inhibition of bovine liver beta-galactosidase using 4-nitrophenyl-beta-D-galactopyranoside substrate measured over 240 mins at 10 mins intervals by U...
In DepthDetails ArticlePubMed
TargetBeta-galactosidase(Bos taurus (Bovine))
University Of Arkansas
Curated by ChEMBL
LigandPNGBDBM50140059(CHEMBL3753015)
Affinity DataIC50:  9.20E+3nM. Assay description: Inhibition of bovine liver beta-galactosidase using 4-nitrophenyl-beta-D-galactopyranoside substrate measured over 240 mins at 10 mins intervals by U...
In DepthDetails ArticlePubMed