BDBM50140350 CHEMBL3754777
SMILES OC(=O)CCNc1nc(cc(n1)-n1cc2ccccc2n1)N1CCN(CC1)c1ccc(F)cc1
InChI Key InChIKey=GLJXHYDYHKCRRM-UHFFFAOYSA-N
Data  1 IC50
  Tab Delimited (TSV)   2D SDfile   Computed 3D by Vconf -m prep SDfile
Find this compound or compounds like it in BindingDB:
Activity Spreadsheet -- Enzyme Inhibition Constant Data from BindingDB
Found 1 hit for monomerid = 50140350
TargetLysine-specific demethylase 6B(Homo sapiens (Human))
Chinese Academy Of Sciences
Curated by ChEMBL
LigandPNGBDBM50140350(CHEMBL3754777)
Affinity DataIC50:  5.80E+3nM. Assay description: Inhibition of JMJD3 (unknown origin) using biotinylated H3K27me3 peptide as substrate after 1 hr by AlphaLISA assay
In DepthDetails ArticlePubMed