BDBM50140372 2-(3-Fluoro-naphthalen-2-yl)-5-methyl-2H-pyrazole-3-carboxylic acid [5-(2-sulfamoyl-phenyl)-pyridin-2-yl]-amide::CHEMBL21013
SMILES Cc1cc(C(=O)Nc2ccc(cn2)-c2ccccc2S(N)(=O)=O)n(n1)-c1cc2ccccc2cc1F
InChI Key InChIKey=VQAMYEMWIZFFPW-UHFFFAOYSA-N
Data  1 IC50
  Tab Delimited (TSV)   2D SDfile   Computed 3D by Vconf -m prep SDfile
Find this compound or compounds like it in BindingDB:
Activity Spreadsheet -- Enzyme Inhibition Constant Data from BindingDB
Found 1 hit for monomerid = 50140372
TargetCoagulation factor X(Homo sapiens (Human))
Millennium Pharmaceuticals
Curated by ChEMBL
LigandPNGBDBM50140372(2-(3-Fluoro-naphthalen-2-yl)-5-methyl-2H-pyrazole-...)
Affinity DataIC50:  81nM. Assay description: Inhibitory concentration against human Coagulation factor X
In DepthDetails ArticlePubMed