BDBM50140387 2-(6-Chloro-naphthalen-2-yl)-5-methyl-2H-pyrazole-3-carboxylic acid [4-(2-oxo-piperidin-1-yl)-phenyl]-amide::CHEMBL20660
SMILES Cc1cc(C(=O)Nc2ccc(cc2)N2CCCCC2=O)n(n1)-c1ccc2cc(Cl)ccc2c1
InChI Key InChIKey=MXOVIZLCZVKFEA-UHFFFAOYSA-N
Data  1 KI  1 IC50
  Tab Delimited (TSV)   2D SDfile   Computed 3D by Vconf -m prep SDfile
Find this compound or compounds like it in BindingDB:
Activity Spreadsheet -- Enzyme Inhibition Constant Data from BindingDB
Found 2 hits for monomerid = 50140387
TargetCoagulation factor X(Homo sapiens (Human))
Millennium Pharmaceuticals
Curated by ChEMBL
LigandPNGBDBM50140387(2-(6-Chloro-naphthalen-2-yl)-5-methyl-2H-pyrazole-...)
Affinity DataKi:  1.10nM. Assay description: Binding affinity against Coagulation factor X
In DepthDetails ArticlePubMed
TargetCoagulation factor X(Homo sapiens (Human))
Millennium Pharmaceuticals
Curated by ChEMBL
LigandPNGBDBM50140387(2-(6-Chloro-naphthalen-2-yl)-5-methyl-2H-pyrazole-...)
Affinity DataIC50:  3nM. Assay description: Inhibitory concentration against human Coagulation factor X
In DepthDetails ArticlePubMed