BDBM50140442 1-(6-Chloro-naphthalen-2-yl)-1H-tetrazole-5-carboxylic acid [2-fluoro-4-(imino-pyrrolidin-1-yl-methyl)-phenyl]-amide::CHEMBL20496
SMILES Fc1cc(ccc1NC(=O)c1nnnn1-c1ccc2cc(Cl)ccc2c1)C(=N)N1CCCC1
InChI Key InChIKey=CWEIGYKXFPMECB-UHFFFAOYSA-N
Data  1 IC50
  Tab Delimited (TSV)   2D SDfile   Computed 3D by Vconf -m prep SDfile
Find this compound or compounds like it in BindingDB:
Activity Spreadsheet -- Enzyme Inhibition Constant Data from BindingDB
Found 1 hit for monomerid = 50140442
TargetCoagulation factor X(Homo sapiens (Human))
Millennium Pharmaceuticals
Curated by ChEMBL
LigandPNGBDBM50140442(1-(6-Chloro-naphthalen-2-yl)-1H-tetrazole-5-carbox...)
Affinity DataIC50:  7nM. Assay description: In vitro inhibitory activity against human coagulation factor X
In DepthDetails ArticlePubMed