BDBM50140871 4-{4-[2-(3,4-Difluoro-phenyl)-ethyl]-piperazin-1-yl}-5H-pyrimido[5,4-b]indol-9-ylamine::CHEMBL25972
SMILES Nc1cccc2[nH]c3c(ncnc3c12)N1CCN(CCc2ccc(F)c(F)c2)CC1
InChI Key InChIKey=AUDMYQPWPLNCSU-UHFFFAOYSA-N
Data  3 IC50
  Tab Delimited (TSV)   2D SDfile   Computed 3D by Vconf -m prep SDfile
Find this compound or compounds like it in BindingDB:
Activity Spreadsheet -- Enzyme Inhibition Constant Data from BindingDB
Found 3 hits for monomerid = 50140871
TargetMultidrug resistance-associated protein 1(Homo sapiens (Human))
Xenova
Curated by ChEMBL
LigandPNGBDBM50140871(4-{4-[2-(3,4-Difluoro-phenyl)-ethyl]-piperazin-1-y...)
Affinity DataIC50:  1.90E+3nM. Assay description: In vitro inhibitory activity against MRP1 (Multidrug resistance associated protein 1) expressed in COR.L23/R cell line in accumulation assay
In DepthDetails ArticlePubMed
TargetATP-dependent translocase ABCB1(Mus musculus (Mouse))
Xenova
Curated by ChEMBL
LigandPNGBDBM50140871(4-{4-[2-(3,4-Difluoro-phenyl)-ethyl]-piperazin-1-y...)
Affinity DataIC50:  2.79E+4nM. Assay description: In vitro inhibitory activity against P-glycoprotein expressed in murine mammary carcinoma (EMT6/AR1.0 cell line) in accumulation assay
In DepthDetails ArticlePubMed
TargetMultidrug resistance-associated protein 1(Homo sapiens (Human))
Xenova
Curated by ChEMBL
LigandPNGBDBM50140871(4-{4-[2-(3,4-Difluoro-phenyl)-ethyl]-piperazin-1-y...)
Affinity DataIC50:  708nM. Assay description: Inhibitory activity against MRP1 (Multidrug resistance associated protein 1) expressed in COR.L23/R cell line in single-dose potentiation assay
In DepthDetails ArticlePubMed