BDBM50141010 6-(5-Chloro-2-methyl-benzyl)-5-methyl-pyrido[2,3-d]pyrimidine-2,4-diamine::CHEMBL34775
SMILES Cc1ccc(Cl)cc1Cc1cnc2nc(N)nc(N)c2c1C
InChI Key InChIKey=WCXBBZIDKOPNRB-UHFFFAOYSA-N
Data  2 IC50
  Tab Delimited (TSV)   2D SDfile   Computed 3D by Vconf -m prep SDfile
Find this compound or compounds like it in BindingDB:
Activity Spreadsheet -- Enzyme Inhibition Constant Data from BindingDB
Found 2 hits for monomerid = 50141010
TargetDihydrofolate reductase(Homo sapiens (Human))
Harvard Medical School
Curated by ChEMBL
LigandPNGBDBM50141010(6-(5-Chloro-2-methyl-benzyl)-5-methyl-pyrido[2,3-d...)
Affinity DataIC50:  0.190nM. Assay description: Inhibitory concentration against dihydrofolate reductase of Mycobacterium avium
In DepthDetails ArticlePubMed
TargetDihydrofolate reductase(Rattus norvegicus (rat))
Harvard Medical School
Curated by ChEMBL
LigandPNGBDBM50141010(6-(5-Chloro-2-methyl-benzyl)-5-methyl-pyrido[2,3-d...)
Affinity DataIC50:  2.80nM. Assay description: Inhibitory concentration against dihdrofolate reductace enzyme of humans
In DepthDetails ArticlePubMed