BDBM50141030 1N-(1-carbamoyl-2-hydroxypropyl)-6-(1-amino-2-phenylethylcarboxamido)-14-(3-aminopropyl)-12-benzyl-9-(1H-5-imidazolylmethyl)-18-(1H-3-indolylmethyl)-7,10,13,16,19-pentaoxo-3,4-dithia-8,11,14,17,20-pentaazacycloicosane-1-carboxamide::CHEMBL415200
SMILES C[C@@H](O)[C@H](NC(=O)[C@H]1CSSC[C@H](NC(=O)[C@H](N)Cc2ccccc2)C(=O)N[C@@H](Cc2cnc[nH]2)C(=O)N[C@@H](Cc2ccccc2)C(=O)N(CCCN)CC(=O)N[C@H](Cc2c[nH]c3ccccc23)C(=O)N1)C(N)=O
InChI Key InChIKey=DWRYDXIVRLJQFS-KWGBNJDESA-N
Data  5 EC50
  Tab Delimited (TSV)   2D SDfile   Computed 3D by Vconf -m prep SDfile
Find this compound or compounds like it in BindingDB:
Activity Spreadsheet -- Enzyme Inhibition Constant Data from BindingDB
Found 5 hits for monomerid = 50141030
TargetMelanocortin receptor 5(Mus musculus (Mouse))
University Of Arizona
Curated by ChEMBL
LigandPNGBDBM50141030(1N-(1-carbamoyl-2-hydroxypropyl)-6-(1-amino-2-phen...)
Affinity DataEC50:  8.5nM. Assay description: Maximum agonist response for mouse melanocortin 5 receptor (MC5R)
In DepthDetails ArticlePubMed
TargetMelanocortin receptor 4(Mus musculus)
University Of Arizona
Curated by ChEMBL
LigandPNGBDBM50141030(1N-(1-carbamoyl-2-hydroxypropyl)-6-(1-amino-2-phen...)
Affinity DataEC50:  180nM. Assay description: Effective concentration for maximum agonist response towards mouse melanocortin 4 receptor
In DepthDetails ArticlePubMed
TargetMelanocyte-stimulating hormone receptor(Homo sapiens (Human))
University Of Arizona
Curated by ChEMBL
LigandPNGBDBM50141030(1N-(1-carbamoyl-2-hydroxypropyl)-6-(1-amino-2-phen...)
Affinity DataEC50:  100nM. Assay description: Effective concentration required for maximum agonist response at melanocortin 1 receptor from frog skin.
In DepthDetails ArticlePubMed
TargetMelanocyte-stimulating hormone receptor(Mus musculus)
University Of Arizona
Curated by ChEMBL
LigandPNGBDBM50141030(1N-(1-carbamoyl-2-hydroxypropyl)-6-(1-amino-2-phen...)
Affinity DataEC50:  47nM. Assay description: Maximal agonist response of mouse melanocortin 1 receptor (MC1R)
In DepthDetails ArticlePubMed
TargetMelanocortin receptor 3(Rattus norvegicus)
University Of Arizona
Curated by ChEMBL
LigandPNGBDBM50141030(1N-(1-carbamoyl-2-hydroxypropyl)-6-(1-amino-2-phen...)
Affinity DataEC50:  660nM. Assay description: Maximal agonist response at rat melanocortin 3 receptor (MC3R)
In DepthDetails ArticlePubMed