BDBM50141267 CHEMBL35211::[4-Methoxy-3-(5-methyl-benzooxazol-2-yl)-phenyl]-carbamic acid methyl ester
SMILES COC(=O)Nc1ccc(OC)c(c1)-c1nc2cc(C)ccc2o1
InChI Key InChIKey=HVUKSIDSDJXZGN-UHFFFAOYSA-N
Data  1 IC50
  Tab Delimited (TSV)   2D SDfile   Computed 3D by Vconf -m prep SDfile
Find this compound or compounds like it in BindingDB:
Activity Spreadsheet -- Enzyme Inhibition Constant Data from BindingDB
Found 1 hit for monomerid = 50141267
Target1-acyl-sn-glycerol-3-phosphate acyltransferase beta(Homo sapiens (Human))
Cell Therapeutics
Curated by ChEMBL
LigandPNGBDBM50141267(CHEMBL35211 | [4-Methoxy-3-(5-methyl-benzooxazol-2...)
Affinity DataIC50:  6.40E+4nM. Assay description: Inhibitory concentration against human lysophosphatidic acid acyltransferase-beta (LPAAT-beta) expressed in Sf9 insect cell membranes
In DepthDetails ArticlePubMed