BDBM50141305 CHEMBL35481::N-[4-Chloro-3-(5-methyl-benzooxazol-2-yl)-phenyl]-acetamide
SMILES CC(=O)Nc1ccc(Cl)c(c1)-c1nc2cc(C)ccc2o1
InChI Key InChIKey=MYOVPAUHWKYTTH-UHFFFAOYSA-N
Data  1 IC50
  Tab Delimited (TSV)   2D SDfile   Computed 3D by Vconf -m prep SDfile
Find this compound or compounds like it in BindingDB:
Activity Spreadsheet -- Enzyme Inhibition Constant Data from BindingDB
Found 1 hit for monomerid = 50141305
Target1-acyl-sn-glycerol-3-phosphate acyltransferase beta(Homo sapiens (Human))
Cell Therapeutics
Curated by ChEMBL
LigandPNGBDBM50141305(CHEMBL35481 | N-[4-Chloro-3-(5-methyl-benzooxazol-...)
Affinity DataIC50:  2.50E+3nM. Assay description: Inhibitory concentration against human lysophosphatidic acid acyltransferase-beta (LPAAT-beta) expressed in Sf9 insect cell membranes
In DepthDetails ArticlePubMed