BDBM50141405 (Z)-3-Amino-3-(2-amino-phenylsulfanyl)-2-[3-(hydroxy-naphthalen-2-yl-methyl)-phenyl]-acrylonitrile::CHEMBL287959
SMILES Nc1ccccc1SC(=N)C(C#N)c1cccc(c1)C(O)c1ccc2ccccc2c1
InChI Key InChIKey=ANQNEHQTAMVMMX-UHFFFAOYSA-N
Data  1 IC50
  Tab Delimited (TSV)   2D SDfile   Computed 3D by Vconf -m prep SDfile
Find this compound or compounds like it in BindingDB:
Activity Spreadsheet -- Enzyme Inhibition Constant Data from BindingDB
Found 1 hit for monomerid = 50141405
TargetDual specificity mitogen-activated protein kinase kinase 1(Homo sapiens (Human))
Bristol-Myers Squibb Pharmaceuticals Research Institute
Curated by ChEMBL
LigandPNGBDBM50141405((Z)-3-Amino-3-(2-amino-phenylsulfanyl)-2-[3-(hydro...)
Affinity DataIC50:  76nM. Assay description: Inhibitory potency against mitogen activated protein kinase kinase kinase 1
In DepthDetails ArticlePubMed