BDBM50141493 (E)-1-(3,5-Di-tert-butyl-4-hydroxy-phenyl)-3-phenyl-propenone::CHEMBL37327
SMILES CC(C)(C)c1cc(cc(c1O)C(C)(C)C)C(=O)\C=C\c1ccccc1
InChI Key InChIKey=XLMFMSKKAMNUAE-OUKQBFOZSA-N
Data  1 IC50
  Tab Delimited (TSV)   2D SDfile   Computed 3D by Vconf -m prep SDfile
Find this compound or compounds like it in BindingDB:
Activity Spreadsheet -- Enzyme Inhibition Constant Data from BindingDB
Found 1 hit for monomerid = 50141493
TargetTumor necrosis factor receptor superfamily member 1A(Homo sapiens (Human))
Atherogenics
Curated by ChEMBL
LigandPNGBDBM50141493((E)-1-(3,5-Di-tert-butyl-4-hydroxy-phenyl)-3-pheny...)
Affinity DataIC50:  4.70E+4nM. Assay description: Inhibition of TNF-alpha-induced VCAM-1 expression
In DepthDetails ArticlePubMed