BDBM50141587 4-(3-Chloro-4-methoxy-benzylamino)-6-cyano-quinoline-3-carboxylic acid (pyridin-2-ylmethyl)-amide::CHEMBL442348
SMILES COc1ccc(CNc2c(cnc3ccc(cc23)C#N)C(=O)NCc2ccccn2)cc1Cl
InChI Key InChIKey=XGMFSLYIURCYRK-UHFFFAOYSA-N
Data  1 IC50
  Tab Delimited (TSV)   2D SDfile   Computed 3D by Vconf -m prep SDfile
Find this compound or compounds like it in BindingDB:
Activity Spreadsheet -- Enzyme Inhibition Constant Data from BindingDB
Found 1 hit for monomerid = 50141587
TargetcGMP-specific 3',5'-cyclic phosphodiesterase(Homo sapiens (Human))
Bristol-Myers Squibb Pharmaceutical Research Institute
Curated by ChEMBL
LigandPNGBDBM50141587(4-(3-Chloro-4-methoxy-benzylamino)-6-cyano-quinoli...)
Affinity DataIC50:  1.30nM. Assay description: Inhibition of phosphodiesterase 5 from human platelets
In DepthDetails ArticlePubMed