BDBM50141699 (2S,3R)-3-Amino-4-cyclohexyl-2-hydroxy-N-(1-naphthalen-2-yl-ethyl)-butyramide::CHEMBL169461
SMILES CC(NC(=O)[C@@H](O)[C@H](N)CC1CCCCC1)c1ccc2ccccc2c1
InChI Key InChIKey=QZBJDJBZGPHHCG-CGDWMNPFSA-N
Data  2 IC50
  Tab Delimited (TSV)   2D SDfile   Computed 3D by Vconf -m prep SDfile
Find this compound or compounds like it in BindingDB:
Activity Spreadsheet -- Enzyme Inhibition Constant Data from BindingDB
Found 2 hits for monomerid = 50141699
TargetMethionine aminopeptidase 1(Homo sapiens (Human))
Abbott Laboratories
Curated by ChEMBL
LigandPNGBDBM50141699((2S,3R)-3-Amino-4-cyclohexyl-2-hydroxy-N-(1-naphth...)
Affinity DataIC50:  5.30E+3nM. Assay description: Inhibitory activity against human methionine aminopeptidase-1
In DepthDetails ArticlePubMed
TargetMethionine aminopeptidase 2(Homo sapiens (Human))
Abbott Laboratories
Curated by ChEMBL
LigandPNGBDBM50141699((2S,3R)-3-Amino-4-cyclohexyl-2-hydroxy-N-(1-naphth...)
Affinity DataIC50:  310nM. Assay description: Inhibitory activity against human methionine aminopeptidase-2
In DepthDetails ArticlePubMed