BDBM50141882 (R)-2-((3S,4S)-3-((4-(3-benzyl-1-ethyl-1H-pyrazol-5-yl)piperidin-1-yl)methyl)-4-(3-fluorophenyl)pyrrolidin-1-yl)-3-cyclopropylpropanoic acid::2-[3-[4-(5-Benzyl-2-ethyl-2H-pyrazol-3-yl)-piperidin-1-ylmethyl]-4-(3-fluoro-phenyl)-pyrrolidin-1-yl]-3-cyclopropyl-propionic acid::CHEMBL175327
SMILES CCn1nc(Cc2ccccc2)cc1C1CCN(C[C@H]2CN(C[C@@H]2c2cccc(F)c2)[C@H](CC2CC2)C(O)=O)CC1
InChI Key InChIKey=WYEUTPJDGLHBSW-HTGHOQDLSA-N
Data  2 IC50
  Tab Delimited (TSV)   2D SDfile   Computed 3D by Vconf -m prep SDfile
Find this compound or compounds like it in BindingDB:
Activity Spreadsheet -- Enzyme Inhibition Constant Data from BindingDB
Found 2 hits for monomerid = 50141882
TargetC-C chemokine receptor type 5(Homo sapiens (Human))
Beijing University Of Technology
Curated by ChEMBL
LigandPNGBDBM50141882((R)-2-((3S,4S)-3-((4-(3-benzyl-1-ethyl-1H-pyrazol-...)
Affinity DataIC50:  1.20nM. Assay description: Displacement of [125I]MIP1alpha from human CCR5 expressed in CHO cells
In DepthDetails ArticlePubMed
TargetC-C chemokine receptor type 5(Homo sapiens (Human))
Beijing University Of Technology
Curated by ChEMBL
LigandPNGBDBM50141882((R)-2-((3S,4S)-3-((4-(3-benzyl-1-ethyl-1H-pyrazol-...)
Affinity DataIC50:  1.20nM. Assay description: Displacement of [125I]-MIP-1 alpha from human CX3C chemokine receptor 5 expressed in CHO cells
In DepthDetails ArticlePubMed