BDBM50142076 CHEMBL3758988
SMILES CN1CCN(CC1)C(=O)CN[C@H]1C[C@@H]1c1ccc(cc1)-c1ccc(F)nc1
InChI Key InChIKey=BTRNASVIWCTTMA-MOPGFXCFSA-N
Data  1 IC50
  Tab Delimited (TSV)   2D SDfile   Computed 3D by Vconf -m prep SDfile
Find this compound or compounds like it in BindingDB:
Activity Spreadsheet -- Enzyme Inhibition Constant Data from BindingDB
Found 1 hit for monomerid = 50142076
TargetLysine-specific histone demethylase 1A(Homo sapiens (Human))
Baylor College Of Medicine
Curated by ChEMBL
LigandPNGBDBM50142076(CHEMBL3758988)
Affinity DataIC50:  77nM. Assay description: Covalent inhibition of recombinant human GST-tagged LSD1 catalytic domain (172 to 833 residues) using dimethylated H3K4 peptide substrate preincubate...
In DepthDetails ArticlePubMed