BDBM50142096 3'-(N,N-Dimethyl-carbamimidoyl)-biphenyl-4-carboxylic acid [4-chloro-2-(5-chloro-pyridin-2-ylcarbamoyl)-phenyl]-amide::CHEMBL368984
SMILES CN(C)C(=N)c1cccc(c1)-c1ccc(cc1)C(=O)Nc1ccc(Cl)cc1C(=O)Nc1ccc(Cl)cn1
InChI Key InChIKey=AGSZXFWXEIGOTP-UHFFFAOYSA-N
Data  1 KI  1 IC50
  Tab Delimited (TSV)   2D SDfile   Computed 3D by Vconf -m prep SDfile
Find this compound or compounds like it in BindingDB:
Activity Spreadsheet -- Enzyme Inhibition Constant Data from BindingDB
Found 2 hits for monomerid = 50142096
TargetCoagulation factor X(Homo sapiens (Human))
Millennium Pharmaceuticals
Curated by ChEMBL
LigandPNGBDBM50142096(3'-(N,N-Dimethyl-carbamimidoyl)-biphenyl-4-carboxy...)
Affinity DataKi:  1nM. Assay description: Inhibitory concentration against coagulation factor Xa.
In DepthDetails ArticlePubMed
TargetCoagulation factor X(Homo sapiens (Human))
Millennium Pharmaceuticals
Curated by ChEMBL
LigandPNGBDBM50142096(3'-(N,N-Dimethyl-carbamimidoyl)-biphenyl-4-carboxy...)
Affinity DataIC50:  2nM. Assay description: Inhibitory concentration against coagulation factor Xa.
In DepthDetails ArticlePubMed